{"text_format":"1","workbook":"xlsx","n_sheets":10,"sheets":["Adviesformulier","Rekenblad","Deeltijd verblijf","Werkwijze rekenmodule","Meerzorg onderbouwing","PGB tarieven","Tarieven ZIN prestaties","Tarieven VPT","Tarieven ZZP","Ruimte behandeling basis MPT"],"not_rendered":{"charts":0,"images":1,"macros":1,"external_links":0,"defined_names":65,"comments":0,"pivot_tables":0},"unopened":[],"bounds":{"document_bytes":16777216,"sheet_cells":100000,"rows_first":2000,"rows_last":500,"rows_between":2000,"halvings":0,"cell_chars":16384,"cell_head_chars":4096},"cells_cut":0,"cells_raw":0,"read":"whole","date_system":"1900"}

{"sheet":"Adviesformulier","index":0,"n_rows":110,"n_cols":23,"rows_kept":110,"cut":false,"hidden":false,"merged":[[5,0,5,3],[5,5,5,10],[9,0,9,6],[9,7,9,11],[10,0,10,6],[10,7,10,11],[0,0,0,12],[2,0,2,12],[4,0,4,3],[4,5,4,10],[1,10,1,12],[12,0,12,6],[6,0,6,3],[24,1,24,12],[31,1,31,12],[34,5,35,11],[6,5,6,10],[12,7,12,11],[20,3,20,11],[11,0,11,6],[11,7,11,11],[36,5,37,11],[22,0,22,12],[28,6,30,12],[71,6,77,12],[38,5,39,11],[40,5,41,11],[42,5,43,11],[44,5,45,11],[55,6,57,12],[46,6,48,12],[70,4,70,10],[113,0,147,12],[78,1,79,12],[81,3,82,12],[83,3,84,12],[109,6,111,12],[89,6,92,12],[98,6,99,12],[93,1,94,12],[100,1,100,12],[103,6,104,12]]}
["Adviesformulier verantwoorde zorg thuis"]
[null,null,null,null,null,null,null,null,null,null,"Versie 29 november 2023"]
["Om te beoordelen of de door u aangevraagde zorg thuis verantwoord is, ontvangen wij graag uw professionele advies.",null,null,null,null,null,null,null,null,null,null,null,null,null,"Woont zelfstandig"]
["CLIENTGEGEVENS",null,null,null,null,null,null,null,null,null,null,null,null,null,"Woont geclusterd"]
["Naam",null,null,null,null,"Klik hier om tekst in te voeren",null,null,null,null,null,null,null,null,"Woont met partner (beide Wlz geïndiceerd)",null,null,null,null,null,null,null,{"$f":"IF(F5=\"Klik hier om een tekst in te voeren\",1,2)","v":2}]
["BSN",null,null,null,null,"Klik hier om tekst in te voeren",null,null,null,null,null,null,null,null,"Woont met partner (partner heeft geen Wlz indicatie)"]
{"$rows_left_out":105}
{"sheet":"Rekenblad","index":1,"n_rows":587,"n_cols":187,"rows_kept":587,"cut":false,"hidden":false,"merged":[[41,3,41,5],[39,3,39,5],[40,11,40,12],[26,11,26,12],[0,7,0,8],[7,6,7,7],[15,6,16,6],[9,6,9,7],[11,6,11,7],[8,8,8,11],[14,6,14,7],[4,5,5,7],[7,8,7,11],[98,9,98,10],[41,11,41,12],[1,56,1,62],[19,12,19,17],[18,12,18,17],[11,14,11,18],[9,14,10,17],[1,28,5,39],[1,21,5,26],[1,27,5,27],[1,19,5,20],[13,15,16,18],[23,16,23,17],[22,16,22,17],[21,16,21,17],[14,10,14,11],[99,9,99,10],[27,11,27,12],[28,11,28,12],[29,11,29,12],[30,11,30,12],[31,11,31,12],[32,11,32,12],[33,11,33,12],[34,11,34,12],[35,11,35,12],[36,11,36,12],[37,11,37,12],[94,9,94,10],[95,9,95,10],[96,9,96,10],[97,9,97,10]]}
[null,null,null,null,null,null,null,0.96399999999999997,null,null,null,null,"versie: 29-11-2023",null,null,null,null,null,null,{"$f":"IF($I$33>0,$M$6+$FS$8+$T$20,$M$6+$FS$8)","v":0},{"$f":"IFERROR(BR10,0)","v":0},{"$f":"M8/M6","v":{"$error":"#DIV/0!"}},null,null,null,null,null,null,null,null,null,null,null,null,null,null,null,null,null,null,null,null,null,null,null,null,null,null,null,null,null,"HH*Gunnings%",{"$f":"BA11*H1","v":38.309359999999998},null,null,null,null,null,null,null,null,null,null,null,null,null,null,null,null,null,null,null,null,null,null,null,null,null,null,null,null,null,null,null,null,null,null,null,null,null,null,null,null,null,null,null,null,null,null,null,null,null,null,null,null,null,null,null,null,null,null,null,null,null,null,null,null,null,null,{"$f":"VLOOKUP(DQ1,$DS$2:$DT$50,2,FALSE)","v":{"$error":"#N/A"}},{"$f":"G10","v":0},"Etmalen deeltijd verblijf",null,null,"meerzorg","ZZP","Dagbesteding","Meerzorg","Max uren +25%","Uren geleverd",null,null,null,null,{"$f":"G10","v":0},{"$f":"IFERROR(VLOOKUP(EE1,DV2:DX83,3,0),0)","v":0},{"$f":"IF(EF1=\"nee\",1,2)","v":2},{"$f":"IF(Q24=\"Meerzorg\",3,4)","v":4},{"$f":"SUM(EG1:EH1)","v":6},{"$f":"IF(EI1=4,\"Meerzorg is niet toegestaan bij dit ZZP tenzij client Wlz indiceerbaar is en recht op het vangnet heeft\",\" \")","v":" "},null,"Te kiezen leveringsvormen",null,null,"MPT","Deelrijd verblijf icm MPT","Logeren icm MPT","Overbruggingszorg","VPT","Opname","Opname2",null,"Z015 ZZP 1vv incl.db","V015 VPT 1vv excl.bh incl.db",null,null,null,"ZZP","100% prestatie",null,null,"100% per dag","100% per week","DTV",null,null,null,"ZZP's","Dagbesteding apart?",null,null,null,"Etmalen","Deeltijd verblijf icm zorg thuis",{"$f":"'Deeltijd verblijf'!M9","v":{"$error":"#N/A"}},null,null,null,null,"AGB","DTV","VBL"]
[null,"Naam:",null,"\"vul hier de naam van cliënt in\"",null,null,null,null,null,null,null,null,null,{"$f":"IFERROR(IF(OR($F$5=\"opname\",$F$5=\"VPT\"),$FI$7*$H$1,$BR$10),0)","v":0},null,null,null,null,null,"Koppeling tijdseenheid aan functie",null,"Koppeling grondslag aan ZZP's",null,null,null,null,null,"Gunningsperceptage","Koppeling prestaties bij bijbehorende functies",null,null,null,null,null,null,null,null,null,null,null,"Koppeling uren aan klasse",null,null,{"$f":"IF(OR(F5=\"Deeltijd verblijf icm MPT\",F5=\"logeren icm MPT\"),\"MPT\",F5)","v":"MPT"},null,null,null,null,null,null,"Koppeling prestatie aan tarief",null,null,null,"Berekening totaalbedragen:",null,"Berekening ZZP waarde",null,null,null,null,null,null,"Ruimte behandeling bepalen",null,"Keuzelijst EKT","Berekening EKT","Extramurale ruimte en beademing",null,{"$f":"IFERROR(VLOOKUP(Q23,BO12:BQ14,3,FALSE),0)","v":0},"Aanvraag akkoord?",null,null,null,"Logeren",null,null,"Omrekening naar huidige rekenmodule",null,null,null,null,null,null,null,null,null,"Dagbesteding",null,null,"PGBbedrag bepalen",null,null,null,null,null,null,null,null,null,null,null,null,"Opslag bepaling",null,null,null,null,null,null,null,null,null,null,null,null,null,null,null,null,null,3.5,"1vg","Licht",{"$f":"IF(D42=\"meerzorg\",\"ja\",\"nee\")","v":"nee"},"1GGZ B","ja","Nee",0,10,null,null,null,null,null,null,null,null,null,null,null,"MPT",null,null,"Bgind","Bgind","Bgind","Bgind","VPTprestatie","Verblijfsprestatie","Verblijfsprestatie",null,"Z025 ZZP 2vv incl.db","V025 VPT 2vv excl.bh incl.db",null,null,null,"1vv","Z015 ZZP 1vv incl.db","Opname",{"$f":"CONCATENATE(FB2,FD2)","v":"1vvOpname"},{"$f":"VLOOKUP(FC2,Tarieven_ZZP1,7,FALSE)","v":120.27},{"$f":"FF2*7","v":841.89},null,null,null,null,"1GGZ-W",1,null,null,null,1,"Logeren icm MPT",{"$f":"'Deeltijd verblijf'!M17","v":{"$error":"#N/A"}},null,null,null,null,{"$f":"E18","v":0},{"$f":"IF(B18=\"Deeltijd_verblijf\",1,0)","v":0},{"$f":"IF(B18=\"Verblijfsprestatie\",1,0)","v":0},{"$f":"SUM(FY2:FZ2)","v":0},{"$f":"IFERROR(IF(FX2=0,\"\",(IF(GA2=0,\"Nee\",\"Ja\"))),0)","v":""},{"$f":"E18","v":0},{"$f":"IFERROR(VLOOKUP(GC2,$GA$18:$GB$18,2,0),0)","v":0},{"$f":"IF(GD2=\"ja\",\"ja\",\"Nee\")","v":"Nee"}]
[null,"BSN",null,"\"vul hier het BSN van cliënt in\"",null,null,null,null,null,null,null,null,null,null,null,null,null,null,null,null,null,null,null,null,null,null,null,null,null,null,null,null,null,null,null,null,null,null,null,null,null,null,null,null,null,null,null,null,null,null,null,null,null,null,null,null,null,null,null,null,null,null,null,null,null,null,null,null,null,null,null,null,null,null,null,null,null,null,null,null,null,null,null,null,null,null,null,null,null,null,null,null,null,null,null,null,null,null,null,null,null,null,null,null,null,null,null,null,null,null,null,null,null,null,null,null,null,null,null,null,null,4,null,null,null,null,null,null,null,null,null,null,null,null,null,null,null,null,null,null,null,"VPT",null,null,"PV","PV","PV","PV","Dagbesteding","Dagbesteding","BHind",null,"Z031 ZZP 3vv excl.bh incl.db","V031 VPT 3vv excl.bh incl.db",null,null,null,"2vv","Z025 ZZP 2vv incl.db","Opname","2vvOpname",154.76,{"$f":"FF3*7","v":1083.32},null,null,null,null,"2GGZ-W",1,null,null,null,2,"MPT",{"$f":"IFERROR(IF(OR($F$5=\"opname\",$F$5=\"VPT\"),$FI$7*$H$1,$BR$10),0)","v":0},null,null,null,null,0,{"$f":"IF(B19=\"Deeltijd_verblijf\",1,0)","v":0},{"$f":"IF(B19=\"Verblijfsprestatie\",1,0)","v":0},{"$f":"SUM(FY3:FZ3)","v":0},{"$f":"IFERROR(IF(FX3=0,\"\",(IF(GA3=0,\"Nee\",\"Ja\"))),0)","v":""},{"$f":"E19","v":0},{"$f":"IFERROR(VLOOKUP(GC3,$GA$18:$GB$18,2,0),0)","v":0},{"$f":"IF(GD3=\"ja\",\"ja\",\"Nee\")","v":"Nee"}]
[null,"Datum aanvraag",null,"\"vul hier de dagtekening van verzending in\"",null,null,null,null,null,null,null,null,null,null,null,null,null,null,null,null,null,null,null,null,null,null,null,null,null,null,null,null,null,null,null,null,null,null,null,null,null,null,null,null,null,null,null,null,null,null,null,null,null,null,null,null,null,null,null,null,null,null,null,null,null,null,null,null,null,null,null,null,null,null,null,null,null,null,null,null,null,null,null,null,null,null,null,null,null,null,null,null,null,null,null,null,null,null,null,null,null,null,null,null,null,null,null,null,null,null,null,null,null,null,null,null,null,null,null,null,null,4.5,null,null,null,null,null,null,null,null,null,null,null,null,null,null,null,null,null,null,null,"Opname",null,null,"VP","VP","VP","VP","Bhind","Bhind",null,null,"Z033 ZZP 3vv incl.bh incl.db","V033 VPT 3vv incl.bh incl.db",null,null,null,"3vv","Z033 ZZP 3vv incl.bh incl.db","Opname","3vvOpname",221.65,1551.55,null,null,null,null,"3GGZ-W",1,null,null,null,3,"VPT",{"$f":"IFERROR(IF(OR($F$5=\"opname\",$F$5=\"VPT\"),$FI$7*$H$1,$BR$10),0)","v":0},null,null,null,null,0,{"$f":"IF(B20=\"Deeltijd_verblijf\",1,0)","v":0},{"$f":"IF(B20=\"Verblijfsprestatie\",1,0)","v":0},0,"",0,0,"Nee"]
[null,"Datum ingang ZTW",null,"\"vul hier de gewenste ingangsdatum zorgtoewijzing in\"",null,"MPT",null,null,"Aantal etmalen  verblijf p/w",null,null,null,{"$f":"IF(F5=\"MPT\",\"Ruimte\",IF(OR(F5=\"logeren icm MPT\",F5=\"deeltijd verblijf icm zorg thuis\"),\"Ruimte\",\"Financiële ruimte\"))","v":"Ruimte"},null,null,null,null,null,null,null,null,null,null,null,null,null,null,null,null,null,null,null,null,null,null,null,null,null,null,null,null,null,null,null,null,null,null,null,null,null,null,null,null,null,null,null,null,null,null,null,null,null,null,null,null,"Ja; Extra kosten thuis",{"$f":"$M$6*25%","v":0},null,null,null,null,null,null,null,null,null,null,null,null,null,null,null,null,null,null,null,null,null,null,null,null,null,null,null,null,null,null,null,null,null,null,null,null,null,null,null,null,null,null,null,null,null,null,null,null,null,null,null,null,null,null,null,null,null,null,null,null,null,null,null,null,null,null,null,null,null,null,null,null,null,null,"Deeltijd verblijf icm zorg thuis",null,null,"Logeren","BGgrp","BGgrp","BGgrp","BHgrp","BHgrp","VPT2",null,"Z041 ZZP 4vv excl.bh incl.db","V041 VPT 4vv excl.bh incl.db",null,null,null,"4vv","Z043 ZZP 4vv incl.bh incl.db","Opname","4vvOpname",214.3,1500.1000000000001,null,null,null,null,"4GGZ-W",1,null,null,null,3.5,"Opname",{"$f":"IFERROR(IF(OR($F$5=\"opname\",$F$5=\"VPT\"),$FI$7*$H$1,$BR$10),0)","v":0},null,null,null,null,0,0,0,0,"",0,0,"Nee"]
[null,"Aan te vragen zorg",null,null,null,null,null,null,null,null,null,null,{"$f":"IFERROR(VLOOKUP(F5,FR1:FS5,2,FALSE),0)","v":0},"Doelmatigheidsbedrag DTV en zorg thuis samen",null,null,null,null,null,null,null,null,null,null,null,null,null,null,null,null,null,null,null,null,null,null,null,null,null,null,null,null,null,null,null,null,null,null,null,null,null,null,null,null,null,null,null,"code","groep",null,null,null,null,null,null,"Ja; opgroeiend kind thuis jonger dan 23 jaar",{"$f":"$M$6*25%","v":0},"Tarief beademing",null,0,"Totale ruimte",null,{"$f":"$M$10+$FS$8+$BX$14","v":0},null,"Totaal ingezet",{"$f":"BD9","v":0},null,null,null,null,null,null,null,null,null,null,null,null,"code","groep","ZZP","ZZP","PV",null,"VP",null,"Bgind",null,"BGgrp",null,"ZZP-"," Totaal ","Totaal minus ophoging",25,"K8",null,"KD09",null,null,null,null,null,null,null,null,{"$f":"IFERROR(VLOOKUP(B18,$T$7:$U$19,2,FALSE),0)","v":0},{"$f":"IF(D18=\"F125 Dagactiviteit LZA\",\"Minuten\",0)","v":0},{"$f":"IF(DM6=\"minuten\",DM6,DL6)","v":0},{"$f":"E18","v":0},"Dagbesteding koppelen aan ZZP",null,null,"2vg","Licht",null,"2GGZ-W","ja","Nee",0,12.5,null,"Grensuren",{"$f":"IFERROR(IF(DU2=\"ja\",VLOOKUP($G$10,$DV$2:$DZ$35,4,FALSE),VLOOKUP($G$10,$DV$36:$DZ$83,4,FALSE)),0)","v":0},null,null,null,null,null,null,null,null,"Logeren icm MPT",null,null,"BGgrp","Bhgrp","Bhgrp","Bhgrp",null,null,"VPTprestatie",null,"Z043 ZZP 4vv incl.bh incl.db","V043 VPT 4vv incl.bh incl.db",null,null,null,"5vv","Z053 ZZP 5vv incl.bh incl.db","Opname","5vvOpname",354.78,2483.46,null,null,null,null,"5GGZ-W",1,null,null,null,4,null,null,null,null,null,null,0,0,0,0,"",0,0,"Nee"]
{"$rows_left_out":582}
{"sheet":"Deeltijd verblijf","index":2,"n_rows":109,"n_cols":24,"rows_kept":109,"cut":false,"hidden":true,"merged":[[17,5,17,6],[4,5,4,6],[6,5,6,6],[8,5,8,6],[13,5,13,6],[15,5,15,6]]}
[]
[null,null,null,null,null,null,null,null,null,null,null,null,"WEEK","DAG",null,{"$f":"VLOOKUP(F7,Tarieven_PGB0,15,FALSE)","v":{"$error":"#N/A"}},null,null,null,null,null,null,null,1]
["Aan te vragen deel verblijf",null,null,null,null,null,null,null,null,null,"Tarief MPT/PGB",null,{"$f":"VLOOKUP(F7,Tarieven_PGB0,15,0)","v":{"$error":"#N/A"}},{"$f":"M3/7","v":{"$error":"#N/A"}},null,null,null,null,null,null,null,null,null,2]
[null,null,null,null,null,null,null,null,null,null,"Tarief per week vbl",null,{"$f":"Rekenblad!FI7*Rekenblad!H1","v":0},{"$f":"M4/7","v":0},null,null,null,null,null,null,null,null,null,3]
["Wlz  sector (Som, PG, VG,LG of ZG)",null,null,null,null,{"$f":"Rekenblad!$G$8","v":0},null,null,null,null,"Dagbesteding","Per jaar",{"$f":"VLOOKUP(F7,Tarieven_PGB0,4,FALSE)","v":{"$error":"#N/A"}},{"$f":"M5/365","v":{"$error":"#N/A"}},"incl vervoer",null,null,null,null,null,null,null,null,3.5]
[null,null,null,null,null,null,null,null,null,null,"Dagbestedingdeel",7,{"$f":"N5*L6","v":{"$error":"#N/A"}},null,null,null,null,null,null,null,null,null,null,4]
{"$rows_left_out":104}
{"sheet":"Werkwijze rekenmodule","index":3,"n_rows":32,"n_cols":1,"rows_kept":32,"cut":false,"hidden":false,"merged":[]}
["A. Werkwijze inclusief veranderingen ten opzichte van huidige versie i.v.m DTV"]
["1. In de rekenmodule iWlz  is bij Aan te vragen zorg  nu \"Deeltijd verblijf icm zorg thuis\" toegevoegd "]
["2. Als voor deeltijdverblijf gekozen wordt, dan wordt het totale doelmatigheidsbedrag weergegeven voor het totaal aan DTV en zorg thuis. De doelmatigheid DTV wordt getoetst tegen deze totale ruimte. Deze ruimte is afhankelijk van de verdeling van het aantal etmalen DTV en zorg thuis (3 ½, 4, 4 ½). "]
["3. De rekenmodule toont het 100% basisbudget voor zorg thuis. Dit wordt voor DTV gebruikt om de aan te vragen percentages te berekenen. Zowel DTV als de zorg thuis wordt uitgedrukt als percentage van het reguliere basisbudget voor zorg thuis (MPT/pgb budget)."]
["4. De rekenmodule toont de verdeling van percentages over de betrokken AGB codes en over de zorgtoewijzing Opname Ja en Opname Nee."]
["5. De aanbieder die de zorg thuis levert krijgt het percentage toegewezen voor de zorg thuis (DTV opname Nee). De aanbieder die het verblijf levert, krijgt de toewijzing voor verblijf (DTV opname Ja). Als 1 aanbieder zowel de zorg thuis als het verblijf levert (bijv. week op week af bij zelfde aanbieder) dan krijgt de verblijfsaanbieder het totale percentage toegewezen via DTV opname Ja.  Vanuit de toewijzing DTV opname Ja levert de verblijfsaanbieder ook de zorg thuis."]
{"$rows_left_out":27}
{"sheet":"Meerzorg onderbouwing","index":4,"n_rows":108,"n_cols":22,"rows_kept":108,"cut":false,"hidden":false,"merged":[[18,1,32,10],[35,1,47,10],[54,1,67,10],[1,8,3,11]]}
["Onderbouwing extreme zorgzwaarte"]
[null,"Uren zorg (PV, VP en Bgind)",null,null,null,{"$f":"P5","v":0},"per week",null,null,null,null,null,null,null,"PV",{"$f":"SUMIF(Rekenblad!$B$17:$B$31,\"PV\",Rekenblad!$F$17:$F$31)","v":0},null,"BGgrp",{"$f":"SUMIF(Rekenblad!$B$17:$B$31,\"BGgrp\",Rekenblad!$F$17:$F$31)","v":0},null,null,{"$f":"F5-K5","v":0}]
[null,"Uren dagbesteding",null,null,null,{"$f":"S2","v":0},"per week",null,null,null,null,null,null,null,"VP",{"$f":"SUMIF(Rekenblad!$B$17:$B$31,\"VP\",Rekenblad!$F$17:$F$31)","v":0},null,"BHgrp",{"$f":"SUMIF(Rekenblad!$B$17:$B$31,\"BHgrp\",Rekenblad!$F$17:$F$31)","v":0}]
[null,"Uren behandeling",null,null,null,{"$f":"S5","v":0},"per week",null,null,null,null,null,null,null,"Bgind",{"$f":"SUMIF(Rekenblad!$B$17:$B$31,\"BGind\",Rekenblad!$F$17:$F$31)","v":0},null,"Bhind",{"$f":"SUMIF(Rekenblad!$B$17:$B$31,\"BHind\",Rekenblad!$F$17:$F$31)","v":0},{"$f":"S4/60","v":0},null,{"$f":"IF(V2<=0,1,2)","v":1}]
[null,"Totale inzet uren",null,null,null,{"$f":"SUM(F2:F4)","v":0},null,"Gemiddeld uren uit het ZZP",null,null,{"$f":"Rekenblad!EC6/7*(7-Rekenblad!I6)","v":0},"(uren *25%)",null,null,null,{"$f":"SUM(P2:P4)/60","v":0},null,null,{"$f":"T4+S3","v":0},null,null,{"$f":"IF(Rekenblad!Q24=\"meerzorg\",5,6)","v":6}]
[null,null,null,null,null,null,null,null,null,null,null,null,null,null,null,null,null,null,null,null,null,{"$f":"SUM(V4:V5)","v":7}]
{"$rows_left_out":103}
{"sheet":"PGB tarieven","index":5,"n_rows":51,"n_cols":15,"rows_kept":51,"cut":false,"hidden":false,"merged":[]}
["Bijlage H. Tarieventabel persoonsgebonden budget-Wlz 2024"]
[]
["ZZP","ZZP",null,null,null,null,null,null,null,null,null,null," Totaal jaarbasis",null,"Totaal weekbasis"]
[null,"code"]
[]
["VV",null,"BEG IND","BEG GR","HH","VP","PV",null,"Totaal jaarbasis"]
{"$rows_left_out":46}
{"sheet":"Tarieven ZIN prestaties","index":6,"n_rows":116,"n_cols":13,"rows_kept":116,"cut":false,"hidden":false,"merged":[]}
["F125 Dagbesteding lza","F125",14.76,null,null,null,null,null,"Komt het profiel voor in PGB range met DB?",null,null,null,{"$f":"IFERROR(VLOOKUP(Rekenblad!G10,I2:J45,2,0),\"\")","v":""}]
["H001G Dagbesteding ggz wonen-1","H001",63.81,null,null,null,null,null,"1vg","ja"]
["H002G Dagbesteding ggz wonen-2","H002",72.83,null,null,null,null,null,"2vg","ja"]
["H003G Dagbesteding ggz wonen-3","H003",62.32,null,null,null,null,null,"3vg","ja"]
["H004G Dagbesteding ggz wonen-4","H004",78.88,null,null,null,null,null,"4vg","ja"]
["H005G Dagbesteding ggz wonen-5","H005",101.37,null,null,null,null,null,"5vg","ja"]
{"$rows_left_out":111}
{"sheet":"Tarieven VPT","index":7,"n_rows":168,"n_cols":10,"rows_kept":168,"cut":false,"hidden":false,"merged":[]}
["Bijlage 4 bij BR/REG-24123a Beleidsregel prestatiebeschrijvingen en tarieven zorgzwaartepakketten en volledig pakket thuis 2024"]
["Onderbouwing beleidsregelwaarde per prestatie",null,null,null,"( a )","( b )"," ( c )","( d )","( e )","(a+b+c+d+e)"]
[null,null,null,null,null,null,null,null,"kapitaallasten dagbesteding kind ghz/ "]
[null,"Code","Prestatie",null,"loon","materieel","NHC"," NIC","dagbehandeling vg emg","BRW totaal"]
[]
["VPT 1vv excl.bh incl.db","V015","ZZP 1vv excl.bh incl.db","V015 VPT 1vv excl.bh incl.db",53.300359564694972,29.64668844883828,3.3468984073334349,0.88006773567170071,0,87.17]
{"$rows_left_out":163}
{"sheet":"Tarieven ZZP","index":8,"n_rows":175,"n_cols":10,"rows_kept":175,"cut":false,"hidden":false,"merged":[]}
["Bijlage 4 bij BR/REG-24123a Beleidsregel prestatiebeschrijvingen en tarieven zorgzwaartepakketten en volledig pakket thuis 2024"]
["Onderbouwing beleidsregelwaarde per prestatie",null,null,null,"( a )","( b )"," ( c )","( d )","( e )","(a+b+c+d+e)"]
[null,null,null,null,null,null,null,null,"kapitaallasten dagbesteding kind ghz/ "]
[null,"Code","Prestatie",null,"Loon","Materieel","NHC"," NIC","dagbehandeling vg emg","BRW totaal"]
[]
[null,"Z015","ZZP 1vv incl.db","Z015 ZZP 1vv incl.db",56.909464165716258,31.757685372767313,28.760990297346495,2.8436672411865556,0,120.27]
{"$rows_left_out":170}
{"sheet":"Ruimte behandeling basis MPT","index":9,"n_rows":46,"n_cols":8,"rows_kept":46,"cut":false,"hidden":false,"merged":[]}
["Profiel","VPT EX behandeling","Bedrag","VPT incl behandeling","Bedrag",null,"Per dag","Per week"]
["1VV","V015",{"$f":"VLOOKUP(B2,Tarieven_VPT0,9,FALSE)","v":87.17},"nvt",{"$f":"IFERROR(VLOOKUP(D2,Tarieven_VPT0,9,FALSE),0)","v":0},{"$f":"E2-C2","v":-87.17},{"$f":"IF(F2>0,F2,0)","v":0},{"$f":"G2*7","v":0}]
["2VV","V025",115.4,"nvt",0,{"$f":"E3-C3","v":-115.4},{"$f":"IF(F3>0,F3,0)","v":0},{"$f":"G3*7","v":0}]
["3VV","V031",152.80000000000001,"V033",179.8,27,27,189]
["4VV","V041",143.76,"V043",157.08000000000001,13.320000000000022,13.320000000000022,93.240000000000151]
["5VV","V051",284.52,"V053",301.14999999999998,16.629999999999995,16.629999999999995,116.40999999999997]
{"$rows_left_out":40}